BDBM40554 5-acetyl-4-methyl-2-[[1-oxo-2-[(5-phenyl-1,3,4-oxadiazol-2-yl)thio]ethyl]amino]-3-thiophenecarboxylic acid ethyl ester::5-acetyl-4-methyl-2-[[2-[(5-phenyl-1,3,4-oxadiazol-2-yl)thio]acetyl]amino]thiophene-3-carboxylic acid ethyl ester::MLS000535481::SMR000142917::cid_2198332::ethyl 5-acetyl-4-methyl-2-({[(5-phenyl-1,3,4-oxadiazol-2-yl)thio]acetyl}amino)-3-thiophenecarboxylate::ethyl 5-acetyl-4-methyl-2-[[2-[(5-phenyl-1,3,4-oxadiazol-2-yl)sulfanyl]acetyl]amino]thiophene-3-carboxylate::ethyl 5-ethanoyl-4-methyl-2-[2-[(5-phenyl-1,3,4-oxadiazol-2-yl)sulfanyl]ethanoylamino]thiophene-3-carboxylate
SMILES CCOC(=O)c1c(C)c(sc1NC(=O)CSc1nnc(o1)-c1ccccc1)C(C)=O
InChI Key InChIKey=ARDPAMXWQAKOCT-UHFFFAOYSA-N
Data  1 EC50
  Tab Delimited (TSV)   2D SDfile   Computed 3D by Vconf -m prep SDfile
Find this compound or compounds like it in BindingDB:
Activity Spreadsheet -- Enzyme Inhibition Constant Data from BindingDB
Found 1 hit for monomerid = 40554
TargetEstrogen receptor(Homo sapiens (Human))
Emory University
Curated by PubChem BioAssay
LigandPNGBDBM40554(5-acetyl-4-methyl-2-[[1-oxo-2-[(5-phenyl-1,3,4-oxa...)
Affinity DataEC50:  1.00E+7nM. Assay description: NIH Molecular Libraries Screening Centers Network [MLSCN] Emory Chemical Biology Discovery Center in MLSCN Assay provider: John A. Katzenellenbogen, ...
In DepthDetails PCBioAssay